Information card for entry 4035666
Formula | C8 H14 Cl N O2 |
Calculated formula | C8 H14 Cl N O2 |
SMILES | [Cl-].[NH2+]1CC2CC1(C2)CCC(=O)O |
Title of publication | Photochemical In-Flow Synthesis of 2,4-Methanopyrrolidines: Pyrrolidine Analogues with Improved Water Solubility and Reduced Lipophilicity. |
Authors of publication | Levterov, Vadym V.; Michurin, Oleg; Borysko, Petro O.; Zozulya, Sergey; Sadkova, Iryna V.; Tolmachev, Andrey A.; Mykhailiuk, Pavel K. |
Journal of publication | The Journal of organic chemistry |
Year of publication | 2018 |
Journal volume | 83 |
Journal issue | 23 |
Pages of publication | 14350 - 14361 |
a | 6.0902 ± 0.0018 Å |
b | 6.5152 ± 0.0017 Å |
c | 24.172 ± 0.007 Å |
α | 90° |
β | 93.433 ± 0.01° |
γ | 90° |
Cell volume | 957.4 ± 0.5 Å3 |
Cell temperature | 296 ± 2 K |
Ambient diffraction temperature | 296 ± 2 K |
Number of distinct elements | 5 |
Space group number | 14 |
Hermann-Mauguin space group symbol | P 1 21/n 1 |
Hall space group symbol | -P 2yn |
Residual factor for all reflections | 0.1261 |
Residual factor for significantly intense reflections | 0.0762 |
Weighted residual factors for significantly intense reflections | 0.1362 |
Weighted residual factors for all reflections included in the refinement | 0.1545 |
Goodness-of-fit parameter for all reflections included in the refinement | 1.056 |
Diffraction radiation wavelength | 0.71073 Å |
Diffraction radiation type | MoKα |