Information card for entry 4064619
Formula | C26 H31 Cl N O P Pd S |
Calculated formula | C26 H31 Cl N O P Pd S |
SMILES | [Pd]12([P](N(S(=O)C(C)(C)C)Cc3ccccc3)(c3ccccc3)c3ccccc3)(Cl)[CH2]=[CH]1C2 |
Title of publication | N-Benzyl-N-phosphino-tert-butylsulfinamide and Its Coordination Modes with Ir(I), Cu(I), Pd(II), and Pt(II): P,S or P,O? |
Authors of publication | Achard, Thierry; Benet-Buchholz, Jordi; Escudero-Adán, Eduardo C.; Riera, Antoni; Verdaguer, Xavier |
Journal of publication | Organometallics |
Year of publication | 2011 |
Journal volume | 30 |
Journal issue | 11 |
Pages of publication | 3119 |
a | 11.8237 ± 0.0017 Å |
b | 14.436 ± 0.002 Å |
c | 14.808 ± 0.002 Å |
α | 90° |
β | 90° |
γ | 90° |
Cell volume | 2527.5 ± 0.6 Å3 |
Cell temperature | 100 ± 2 K |
Ambient diffraction temperature | 100 ± 2 K |
Number of distinct elements | 8 |
Space group number | 19 |
Hermann-Mauguin space group symbol | P 21 21 21 |
Hall space group symbol | P 2ac 2ab |
Residual factor for all reflections | 0.0368 |
Residual factor for significantly intense reflections | 0.0351 |
Weighted residual factors for significantly intense reflections | 0.0906 |
Weighted residual factors for all reflections included in the refinement | 0.092 |
Goodness-of-fit parameter for all reflections included in the refinement | 1.079 |
Diffraction radiation wavelength | 0.71073 Å |
Diffraction radiation type | MoKα |