Information card for entry 4127531
Formula | C50 H67 Cl Co2.32 N8 Ni1.68 O28 |
Calculated formula | C50 H67 Cl Co2.32 N8 Ni1.68 O28 |
Title of publication | Mechanistically Driven Control over Cubane Oxo Cluster Catalysts. |
Authors of publication | Song, Fangyuan; Al-Ameed, Karrar; Schilling, Mauro; Fox, Thomas; Luber, Sandra; Patzke, Greta R. |
Journal of publication | Journal of the American Chemical Society |
Year of publication | 2019 |
Journal volume | 141 |
Journal issue | 22 |
Pages of publication | 8846 - 8857 |
a | 12.0091 ± 0.0003 Å |
b | 23.9541 ± 0.0007 Å |
c | 21.5009 ± 0.0005 Å |
α | 90° |
β | 100.068 ± 0.002° |
γ | 90° |
Cell volume | 6089.9 ± 0.3 Å3 |
Cell temperature | 160 ± 0.1 K |
Ambient diffraction temperature | 160 ± 0.1 K |
Number of distinct elements | 7 |
Space group number | 14 |
Hermann-Mauguin space group symbol | P 1 21/c 1 |
Hall space group symbol | -P 2ybc |
Residual factor for all reflections | 0.0576 |
Residual factor for significantly intense reflections | 0.0366 |
Weighted residual factors for significantly intense reflections | 0.0693 |
Weighted residual factors for all reflections included in the refinement | 0.0746 |
Goodness-of-fit parameter for all reflections included in the refinement | 1.013 |
Diffraction radiation probe | x-ray |
Diffraction radiation wavelength | 0.71073 Å |
Diffraction radiation type | MoKα |