Information card for entry 4127538
Formula | C50 H67 B F4 N8 Ni4 O25 |
Calculated formula | C50 H50.508 B F4 N8 Ni4 O24.999 |
Title of publication | Mechanistically Driven Control over Cubane Oxo Cluster Catalysts. |
Authors of publication | Song, Fangyuan; Al-Ameed, Karrar; Schilling, Mauro; Fox, Thomas; Luber, Sandra; Patzke, Greta R. |
Journal of publication | Journal of the American Chemical Society |
Year of publication | 2019 |
Journal volume | 141 |
Journal issue | 22 |
Pages of publication | 8846 - 8857 |
a | 11.9815 ± 0.0003 Å |
b | 24.6554 ± 0.0007 Å |
c | 21.5499 ± 0.0006 Å |
α | 90° |
β | 101.629 ± 0.003° |
γ | 90° |
Cell volume | 6235.4 ± 0.3 Å3 |
Cell temperature | 160 ± 0.1 K |
Ambient diffraction temperature | 160 ± 0.1 K |
Number of distinct elements | 7 |
Space group number | 14 |
Hermann-Mauguin space group symbol | P 1 21/c 1 |
Hall space group symbol | -P 2ybc |
Residual factor for all reflections | 0.0513 |
Residual factor for significantly intense reflections | 0.0393 |
Weighted residual factors for significantly intense reflections | 0.1003 |
Weighted residual factors for all reflections included in the refinement | 0.1061 |
Goodness-of-fit parameter for all reflections included in the refinement | 1.037 |
Diffraction radiation probe | x-ray |
Diffraction radiation wavelength | 0.71073 Å |
Diffraction radiation type | MoKα |