Information card for entry 4127539
Formula | C50 H68 Cl N8 Ni4 O25.5 |
Calculated formula | C50 H47 Cl N8 Ni4 O25.5 |
Title of publication | Mechanistically Driven Control over Cubane Oxo Cluster Catalysts. |
Authors of publication | Song, Fangyuan; Al-Ameed, Karrar; Schilling, Mauro; Fox, Thomas; Luber, Sandra; Patzke, Greta R. |
Journal of publication | Journal of the American Chemical Society |
Year of publication | 2019 |
Journal volume | 141 |
Journal issue | 22 |
Pages of publication | 8846 - 8857 |
a | 11.951 ± 0.0003 Å |
b | 24.1715 ± 0.0005 Å |
c | 21.506 ± 0.0006 Å |
α | 90° |
β | 100.333 ± 0.002° |
γ | 90° |
Cell volume | 6111.8 ± 0.3 Å3 |
Cell temperature | 183 ± 0.1 K |
Ambient diffraction temperature | 183 ± 0.1 K |
Number of distinct elements | 6 |
Space group number | 14 |
Hermann-Mauguin space group symbol | P 1 21/c 1 |
Hall space group symbol | -P 2ybc |
Residual factor for all reflections | 0.0515 |
Residual factor for significantly intense reflections | 0.0413 |
Weighted residual factors for significantly intense reflections | 0.1141 |
Weighted residual factors for all reflections included in the refinement | 0.1203 |
Goodness-of-fit parameter for all reflections included in the refinement | 1.03 |
Diffraction radiation probe | x-ray |
Diffraction radiation wavelength | 0.71073 Å |
Diffraction radiation type | MoKα |