Information card for entry 4127561
Formula | C20 H24 Cl Ir N2 |
Calculated formula | C20 H24 Cl Ir N2 |
SMILES | [Ir]12345(Cl)([n]6n(ccc6)c6ccc(cc16)C)[c]1([c]2([c]3([c]4([c]51C)C)C)C)C |
Title of publication | The Importance of Kinetic and Thermodynamic Control when Assessing Mechanisms of Carboxylate-Assisted C-H Activation. |
Authors of publication | Alharis, Raed A.; McMullin, Claire L.; Davies, David L.; Singh, Kuldip; Macgregor, Stuart A. |
Journal of publication | Journal of the American Chemical Society |
Year of publication | 2019 |
Journal volume | 141 |
Journal issue | 22 |
Pages of publication | 8896 - 8906 |
a | 8.2734 ± 0.0017 Å |
b | 14.594 ± 0.003 Å |
c | 15.557 ± 0.003 Å |
α | 90° |
β | 93.433 ± 0.004° |
γ | 90° |
Cell volume | 1875 ± 0.7 Å3 |
Cell temperature | 150 ± 2 K |
Ambient diffraction temperature | 150 ± 2 K |
Number of distinct elements | 5 |
Space group number | 14 |
Hermann-Mauguin space group symbol | P 1 21/n 1 |
Hall space group symbol | -P 2yn |
Residual factor for all reflections | 0.0493 |
Residual factor for significantly intense reflections | 0.0358 |
Weighted residual factors for significantly intense reflections | 0.0682 |
Weighted residual factors for all reflections included in the refinement | 0.0714 |
Goodness-of-fit parameter for all reflections included in the refinement | 0.922 |
Diffraction radiation wavelength | 0.71073 Å |
Diffraction radiation type | MoKα |