Information card for entry 4321192
Formula | C6 H8 Ag N3 O2 |
Calculated formula | C6 H8 Ag N3 O2 |
Title of publication | Synthesis and Characterization of Water-Soluble Silver(I) Complexes with l-Histidine (H2his) and (S)-(-)-2-Pyrrolidone-5-carboxylic Acid (H2pyrrld) Showing a Wide Spectrum of Effective Antibacterial and Antifungal Activities. Crystal Structures of Chiral Helical Polymers [Ag(Hhis)]n and {[Ag(Hpyrrld)]2}n in the Solid State |
Authors of publication | Nomiya, Kenji; Takahashi, Satoshi; Noguchi, Ryusuke; Nemoto, Satomi; Takayama, Toshio; Oda, Munehiro |
Journal of publication | Inorganic Chemistry |
Year of publication | 2000 |
Journal volume | 39 |
Pages of publication | 3301 - 3311 |
a | 5.739 ± 0.001 Å |
b | 7.671 ± 0.002 Å |
c | 9.04 ± 0.001 Å |
α | 90° |
β | 104.73 ± 0.01° |
γ | 90° |
Cell volume | 384.9 ± 0.13 Å3 |
Cell temperature | 296.2 K |
Ambient diffraction temperature | 296.2 K |
Number of distinct elements | 5 |
Space group number | 4 |
Hermann-Mauguin space group symbol | P 1 21 1 |
Hall space group symbol | P 2yb |
Residual factor for all reflections | 0.0241 |
Residual factor for significantly intense reflections | 0.024 |
Weighted residual factors for all reflections | 0.028 |
Weighted residual factors for all reflections included in the refinement | 0.028 |
Goodness-of-fit parameter for all reflections | 1.289 |
Goodness-of-fit parameter for all reflections included in the refinement | 1.29 |
Diffraction radiation wavelength | 0.7107 Å |
Diffraction radiation type | MoKα |