Information card for entry 4504958
Common name | 2,4,6-tris(4-iodophenoxy)-1,3,5-triazine, mesitylene |
Chemical name | 2,4,6-tris(4-iodophenoxy)-1,3,5-triazine, mesitylene |
Formula | C51 H36 I6 N6 O6 |
Calculated formula | C51 H24 I6 N6 O6 |
Title of publication | Halogen Trimer-Mediated Hexagonal Host Framework of 2,4,6-Tris(4-halophenoxy)-1,3,5-triazine. Supramolecular Isomerism from Hexagonal Channel (X = Cl, Br) to Cage Structure (X = I) |
Authors of publication | Saha, Binoy K.; Jetti, Ram K. R.; Reddy, L. Sreenivas; Aitipamula, Srinivasulu; Nangia, Ashwini |
Journal of publication | Crystal Growth & Design |
Year of publication | 2005 |
Journal volume | 5 |
Journal issue | 3 |
Pages of publication | 887 |
a | 15.668 ± 0.003 Å |
b | 15.668 ± 0.003 Å |
c | 18.475 ± 0.005 Å |
α | 90° |
β | 90° |
γ | 120° |
Cell volume | 3927.7 ± 1.5 Å3 |
Cell temperature | 183 ± 2 K |
Ambient diffraction temperature | 183 ± 2 K |
Number of distinct elements | 5 |
Space group number | 148 |
Hermann-Mauguin space group symbol | R -3 :H |
Hall space group symbol | -R 3 |
Residual factor for all reflections | 0.059 |
Residual factor for significantly intense reflections | 0.0489 |
Weighted residual factors for significantly intense reflections | 0.1167 |
Weighted residual factors for all reflections included in the refinement | 0.1237 |
Goodness-of-fit parameter for all reflections included in the refinement | 1.057 |
Diffraction radiation wavelength | 0.71073 Å |
Diffraction radiation type | MoKα |