Information card for entry 4504972
Chemical name | Gamma Glycine |
Formula | C2 H5 N O2 |
Calculated formula | C2 H5 N O2 |
SMILES | [O-]C(=O)C[NH3+] |
Title of publication | Effect of High Pressure on the Crystal Structures of Polymorphs of Glycine |
Authors of publication | Dawson, Alice; Allan, David R.; Belmonte, Scott A.; Clark, Stewart J.; David, William I. F.; McGregor, Pamela A.; Parsons, Simon; Pulham, Colin R.; Sawyer, Lindsay |
Journal of publication | Crystal Growth & Design |
Year of publication | 2005 |
Journal volume | 5 |
Journal issue | 4 |
Pages of publication | 1415 |
a | 6.8617 ± 0.0004 Å |
b | 6.8617 ± 0.0004 Å |
c | 5.4282 ± 0.0006 Å |
α | 90° |
β | 90° |
γ | 120° |
Cell volume | 221.33 ± 0.03 Å3 |
Cell temperature | 293 K |
Ambient diffraction temperature | 293 K |
Ambient diffracton pressure | 0 kPa |
Number of distinct elements | 4 |
Space group number | 144 |
Hermann-Mauguin space group symbol | P 31 |
Hall space group symbol | P 31 |
Residual factor for all reflections | 0.0993 |
Residual factor for significantly intense reflections | 0.0895 |
Weighted residual factors for all reflections | 0.182 |
Weighted residual factors for significantly intense reflections | 0.1733 |
Weighted residual factors for all reflections included in the refinement | 0.182 |
Goodness-of-fit parameter for all reflections included in the refinement | 1.151 |
Diffraction radiation wavelength | 0.71073 Å |
Diffraction radiation type | MoKα |