Information card for entry 4504995
Chemical name | 4-Nitrobenzoic acid 4,4'-bipyridine |
Formula | C12 H9 N2 O4 |
Calculated formula | C12 H9 N2 O4 |
Title of publication | Structural Consequences of Strong and Weak Interactions to Binary Benzoic Acid/Bipyridine Supramolecular Assemblies |
Authors of publication | Bowers, Jeffrey R.; Hopkins, Gregory W.; Yap, Glenn P. A.; Wheeler, Kraig A. |
Journal of publication | Crystal Growth & Design |
Year of publication | 2005 |
Journal volume | 5 |
Journal issue | 2 |
Pages of publication | 727 |
a | 7.8386 ± 0.0004 Å |
b | 6.8499 ± 0.0004 Å |
c | 20.7925 ± 0.001 Å |
α | 90° |
β | 92.559 ± 0.004° |
γ | 90° |
Cell volume | 1115.31 ± 0.1 Å3 |
Cell temperature | 298 ± 2 K |
Ambient diffraction temperature | 298 ± 2 K |
Number of distinct elements | 4 |
Space group number | 14 |
Hermann-Mauguin space group symbol | P 1 21/n 1 |
Hall space group symbol | -P 2yn |
Residual factor for all reflections | 0.1139 |
Residual factor for significantly intense reflections | 0.0554 |
Weighted residual factors for significantly intense reflections | 0.1236 |
Weighted residual factors for all reflections included in the refinement | 0.1519 |
Goodness-of-fit parameter for all reflections included in the refinement | 1.011 |
Diffraction radiation wavelength | 0.71073 Å |
Diffraction radiation type | MoKα |