Information card for entry 7033054
Formula | C25 H25 B F2 N2 O |
Calculated formula | C25 H25 B F2 N2 O |
SMILES | c12ccccc1oc1c3ccccc3N(c3c(C(C)C)cccc3C(C)C)[B]([n]21)(F)F |
Title of publication | Synthesis, structures and electrochemical and photophysical properties of anilido-benzoxazole boron difluoride (ABB) complexes. |
Authors of publication | Meesala, Yedukondalu; Kavala, Veerababurao; Chang, Hao-Ching; Kuo, Ting-Shen; Yao, Ching-Fa; Lee, Way-Zen |
Journal of publication | Dalton transactions (Cambridge, England : 2003) |
Year of publication | 2015 |
Journal volume | 44 |
Journal issue | 3 |
Pages of publication | 1120 - 1129 |
a | 9.6279 ± 0.0019 Å |
b | 18.412 ± 0.003 Å |
c | 24.12 ± 0.005 Å |
α | 90° |
β | 90° |
γ | 90° |
Cell volume | 4275.7 ± 1.4 Å3 |
Cell temperature | 200 ± 2 K |
Ambient diffraction temperature | 200 ± 2 K |
Number of distinct elements | 6 |
Space group number | 61 |
Hermann-Mauguin space group symbol | P b c a |
Hall space group symbol | -P 2ac 2ab |
Residual factor for all reflections | 0.1535 |
Residual factor for significantly intense reflections | 0.0603 |
Weighted residual factors for significantly intense reflections | 0.1224 |
Weighted residual factors for all reflections included in the refinement | 0.1621 |
Goodness-of-fit parameter for all reflections included in the refinement | 0.92 |
Diffraction radiation wavelength | 0.71073 Å |
Diffraction radiation type | MoKα |