Information card for entry 7033609
Formula | C88 H100 Dy4 N12 O33.96 |
Calculated formula | C88 H100 Dy4 N12 O33.96 |
Title of publication | A salen-type Dy4 single-molecule magnet with an enhanced energy barrier and its analogues. |
Authors of publication | Luan, Fang; Yan, Pengfei; Zhu, Jing; Liu, Tianqi; Zou, Xiaoyan; Li, Guangming |
Journal of publication | Dalton transactions (Cambridge, England : 2003) |
Year of publication | 2015 |
Journal volume | 44 |
Journal issue | 9 |
Pages of publication | 4046 - 4053 |
a | 14.4293 ± 0.0007 Å |
b | 14.5421 ± 0.0009 Å |
c | 14.7018 ± 0.0008 Å |
α | 111.061 ± 0.005° |
β | 104.181 ± 0.004° |
γ | 107.967 ± 0.005° |
Cell volume | 2508.8 ± 0.3 Å3 |
Cell temperature | 293 ± 2 K |
Ambient diffraction temperature | 293 ± 2 K |
Number of distinct elements | 5 |
Space group number | 2 |
Hermann-Mauguin space group symbol | P -1 |
Hall space group symbol | -P 1 |
Residual factor for all reflections | 0.0516 |
Residual factor for significantly intense reflections | 0.0351 |
Weighted residual factors for significantly intense reflections | 0.0819 |
Weighted residual factors for all reflections included in the refinement | 0.093 |
Goodness-of-fit parameter for all reflections included in the refinement | 1.074 |
Diffraction radiation wavelength | 0.71073 Å |
Diffraction radiation type | MoKα |