Information card for entry 7044166
Formula |
Ga4 S15 Yb6 |
Calculated formula |
Ga4 S15 Yb6 |
Title of publication |
Two new phases in the ternary RE‒Ga‒S systems with unique interlinkage of GaS4 building units: synthesis, structure, and properties |
Authors of publication |
Lin, Hua; Shen, Jinni; Zhu, Wei-Wei; Liu, Yi; Wu, Xin-Tao; Zhu, Qi-Long; Wu, Li-Ming |
Journal of publication |
Dalton Trans. |
Year of publication |
2017 |
a |
23.557 ± 0.002 Å |
b |
3.7664 ± 0.0004 Å |
c |
12.4658 ± 0.0013 Å |
α |
90° |
β |
90.915 ± 0.009° |
γ |
90° |
Cell volume |
1105.89 ± 0.19 Å3 |
Cell temperature |
293 ± 2 K |
Ambient diffraction temperature |
293 ± 2 K |
Number of distinct elements |
3 |
Space group number |
12 |
Hermann-Mauguin space group symbol |
C 1 2/m 1 |
Hall space group symbol |
-C 2y |
Residual factor for all reflections |
0.0243 |
Residual factor for significantly intense reflections |
0.0232 |
Weighted residual factors for significantly intense reflections |
0.0547 |
Weighted residual factors for all reflections included in the refinement |
0.0555 |
Goodness-of-fit parameter for all reflections included in the refinement |
1.066 |
Diffraction radiation wavelength |
0.71073 Å |
Diffraction radiation type |
MoKα |
Yes |
No |
No |