Information card for entry 7045099
Formula | C32 H24 F N O2 Sn |
Calculated formula | C32 H24 F N O2 Sn |
SMILES | C(=O)(c1ccc(cc1)/C=N/c1ccc(cc1)F)O[Sn](c1ccccc1)(c1ccccc1)c1ccccc1 |
Title of publication | Triphenylstannyl((arylimino)methyl)benzoates with selective potency that induce G1 and G2/M cell cycle arrest and trigger apoptosis via ROS in human cervical cancer cells. |
Authors of publication | Basu Baul, Tushar S.; Longkumer, Imliwati; Duthie, Andrew; Singh, Priya; Koch, Biplob; Guedes da Silva, M Fátima C |
Journal of publication | Dalton transactions (Cambridge, England : 2003) |
Year of publication | 2018 |
Journal volume | 47 |
Journal issue | 6 |
Pages of publication | 1993 - 2008 |
a | 19.5733 ± 0.0007 Å |
b | 14.9548 ± 0.0005 Å |
c | 18.3132 ± 0.0006 Å |
α | 90° |
β | 90° |
γ | 90° |
Cell volume | 5360.5 ± 0.3 Å3 |
Cell temperature | 296 ± 2 K |
Ambient diffraction temperature | 296 ± 2 K |
Number of distinct elements | 6 |
Space group number | 29 |
Hermann-Mauguin space group symbol | P c a 21 |
Hall space group symbol | P 2c -2ac |
Residual factor for all reflections | 0.0462 |
Residual factor for significantly intense reflections | 0.0312 |
Weighted residual factors for significantly intense reflections | 0.0646 |
Weighted residual factors for all reflections included in the refinement | 0.0732 |
Goodness-of-fit parameter for all reflections included in the refinement | 1.079 |
Diffraction radiation wavelength | 0.71073 Å |
Diffraction radiation type | MoKα |