Information card for entry 7045181
Formula | C29 H30 Si2 |
Calculated formula | C29 H30 Si2 |
SMILES | [Si](/C(=C/[Si](C)(C)C)c1ccccc1)(c1ccccc1)(c1ccccc1)c1ccccc1 |
Title of publication | Highly selective hydrosilylation of olefins and acetylenes by platinum(0) complexes bearing bulky N-heterocyclic carbene ligands. |
Authors of publication | Żak, P; Bołt, M; Kubicki, M.; Pietraszuk, C. |
Journal of publication | Dalton transactions (Cambridge, England : 2003) |
Year of publication | 2018 |
Journal volume | 47 |
Journal issue | 6 |
Pages of publication | 1903 - 1910 |
a | 8.4538 ± 0.0003 Å |
b | 9.4718 ± 0.0002 Å |
c | 18.2391 ± 0.0005 Å |
α | 96.59 ± 0.002° |
β | 94.901 ± 0.002° |
γ | 112.805 ± 0.002° |
Cell volume | 1323.87 ± 0.07 Å3 |
Cell temperature | 295 ± 2 K |
Ambient diffraction temperature | 295 ± 2 K |
Number of distinct elements | 3 |
Space group number | 2 |
Hermann-Mauguin space group symbol | P -1 |
Hall space group symbol | -P 1 |
Residual factor for all reflections | 0.0412 |
Residual factor for significantly intense reflections | 0.0397 |
Weighted residual factors for significantly intense reflections | 0.111 |
Weighted residual factors for all reflections included in the refinement | 0.1125 |
Goodness-of-fit parameter for all reflections included in the refinement | 1.06 |
Diffraction radiation probe | x-ray |
Diffraction radiation wavelength | 1.54184 Å |
Diffraction radiation type | CuKα |