Information card for entry 7121240
Formula | C25 H19 N |
Calculated formula | C25 H19 N |
Title of publication | Isolation and structural characterization of a titanacyclopropane as key intermediate in the double aryl Grignard addition to 2-(arylethynyl)pyridine derivatives. |
Authors of publication | Foschi, Francesco; Roth, Torsten; Enders, Markus; Wadepohl, Hubert; Clot, Eric; Gade, Lutz H. |
Journal of publication | Chemical communications (Cambridge, England) |
Year of publication | 2018 |
Journal volume | 54 |
Journal issue | 18 |
Pages of publication | 2228 - 2231 |
a | 9.652 ± 0.005 Å |
b | 9.262 ± 0.004 Å |
c | 10.579 ± 0.005 Å |
α | 90° |
β | 107.03 ± 0.014° |
γ | 90° |
Cell volume | 904.3 ± 0.7 Å3 |
Cell temperature | 100 ± 2 K |
Ambient diffraction temperature | 100 ± 1 K |
Number of distinct elements | 3 |
Space group number | 4 |
Hermann-Mauguin space group symbol | P 1 21 1 |
Hall space group symbol | P 2yb |
Residual factor for all reflections | 0.0608 |
Residual factor for significantly intense reflections | 0.0449 |
Weighted residual factors for significantly intense reflections | 0.0937 |
Weighted residual factors for all reflections included in the refinement | 0.1009 |
Goodness-of-fit parameter for all reflections included in the refinement | 1.048 |
Diffraction radiation probe | x-ray |
Diffraction radiation wavelength | 0.71073 Å |
Diffraction radiation type | MoKα |