Information card for entry 7122802
Formula | C20 H21 Cl N2 O Ru |
Calculated formula | C20 H21 Cl N2 O Ru |
Title of publication | New half-sandwich ruthenium(ii) complexes as proteosynthesis inhibitors in cancer cells. |
Authors of publication | Ballester, Francisco J.; Ortega, Enrique; Porto, Vanesa; Kostrhunova, Hana; Davila-Ferreira, Nerea; Bautista, Delia; Brabec, Viktor; Domínguez, Fernando; Santana, M. Dolores; Ruiz, José |
Journal of publication | Chemical communications (Cambridge, England) |
Year of publication | 2019 |
a | 10.7146 ± 0.0005 Å |
b | 13.1262 ± 0.0006 Å |
c | 12.7262 ± 0.0005 Å |
α | 90° |
β | 92.545 ± 0.002° |
γ | 90° |
Cell volume | 1788.07 ± 0.14 Å3 |
Cell temperature | 100 ± 2 K |
Ambient diffraction temperature | 100 ± 2 K |
Number of distinct elements | 6 |
Space group number | 14 |
Hermann-Mauguin space group symbol | P 1 21/n 1 |
Hall space group symbol | -P 2yn |
Residual factor for all reflections | 0.0274 |
Residual factor for significantly intense reflections | 0.0219 |
Weighted residual factors for significantly intense reflections | 0.0475 |
Weighted residual factors for all reflections included in the refinement | 0.0494 |
Goodness-of-fit parameter for all reflections included in the refinement | 1.084 |
Diffraction radiation wavelength | 0.71073 Å |
Diffraction radiation type | MoKα |