Information card for entry 7216043
Formula | C16 H38 Co O20 P4 |
Calculated formula | C16 H34 Co O20 P4 |
Title of publication | Tuning the structure of metal phosphonates using uncoordinating methyl group: syntheses, structures and properties of a series of metal diphosphonates |
Authors of publication | Tang, Si-Fu; Li, Liang-Jun; Lv, Xiao-Xia; Wang, Chao; Zhao, Xue-Bo |
Journal of publication | CrystEngComm |
Year of publication | 2014 |
Journal volume | 16 |
Journal issue | 30 |
Pages of publication | 7043 |
a | 12.363 ± 0.002 Å |
b | 7.8134 ± 0.0013 Å |
c | 15.311 ± 0.003 Å |
α | 90° |
β | 93.942 ± 0.004° |
γ | 90° |
Cell volume | 1475.5 ± 0.4 Å3 |
Cell temperature | 296 ± 2 K |
Ambient diffraction temperature | 296 ± 2 K |
Number of distinct elements | 5 |
Space group number | 14 |
Hermann-Mauguin space group symbol | P 1 21/c 1 |
Hall space group symbol | -P 2ybc |
Residual factor for all reflections | 0.1145 |
Residual factor for significantly intense reflections | 0.0592 |
Weighted residual factors for significantly intense reflections | 0.1266 |
Weighted residual factors for all reflections included in the refinement | 0.1552 |
Goodness-of-fit parameter for all reflections included in the refinement | 1.014 |
Diffraction radiation wavelength | 0.71073 Å |
Diffraction radiation type | MoKα |