Information card for entry 7216044
Formula | C8 H26 Ni O14 P2 |
Calculated formula | C8 H26 Ni O14 P2 |
Title of publication | Tuning the structure of metal phosphonates using uncoordinating methyl group: syntheses, structures and properties of a series of metal diphosphonates |
Authors of publication | Tang, Si-Fu; Li, Liang-Jun; Lv, Xiao-Xia; Wang, Chao; Zhao, Xue-Bo |
Journal of publication | CrystEngComm |
Year of publication | 2014 |
Journal volume | 16 |
Journal issue | 30 |
Pages of publication | 7043 |
a | 6.7912 ± 0.0011 Å |
b | 9.6878 ± 0.0016 Å |
c | 13.786 ± 0.002 Å |
α | 96.736 ± 0.002° |
β | 95.816 ± 0.005° |
γ | 91.082 ± 0.005° |
Cell volume | 895.7 ± 0.2 Å3 |
Cell temperature | 296 ± 2 K |
Ambient diffraction temperature | 296 ± 2 K |
Number of distinct elements | 5 |
Space group number | 2 |
Hermann-Mauguin space group symbol | P -1 |
Hall space group symbol | -P 1 |
Residual factor for all reflections | 0.0681 |
Residual factor for significantly intense reflections | 0.0444 |
Weighted residual factors for significantly intense reflections | 0.0941 |
Weighted residual factors for all reflections included in the refinement | 0.1016 |
Goodness-of-fit parameter for all reflections included in the refinement | 0.922 |
Diffraction radiation wavelength | 0.71073 Å |
Diffraction radiation type | MoKα |