Information card for entry 7231643
Common name | Bis-(N-(2-aminoethyl)-1-methyl-1H-imidazole-2-carboxamido) nickel(II) |
Chemical name | Bis-(N-(2-aminoethyl)-1-methyl-1H-imidazole-2-carboxamido) nickel(II) |
Formula | C14 H24 N8 Ni O3 |
Calculated formula | C14 H24 N8 Ni O3 |
Title of publication | Streams, cascades, and pools: various water cluster motifs in structurally similar Ni(ii) complexes |
Authors of publication | Saraei, Nina; Hietsoi, Oleksandr; Mullins, Christopher S.; Gupta, Alexander J.; Frye, Brian C.; Mashuta, Mark S.; Buchanan, Robert M.; Grapperhaus, Craig A. |
Journal of publication | CrystEngComm |
Year of publication | 2018 |
Journal volume | 20 |
Journal issue | 44 |
Pages of publication | 7071 |
a | 9.1756 ± 0.0019 Å |
b | 10.59 ± 0.002 Å |
c | 9.4434 ± 0.0019 Å |
α | 90° |
β | 98.876 ± 0.003° |
γ | 90° |
Cell volume | 906.6 ± 0.3 Å3 |
Cell temperature | 100 ± 2 K |
Ambient diffraction temperature | 100 ± 2 K |
Number of distinct elements | 5 |
Space group number | 13 |
Hermann-Mauguin space group symbol | P 1 2/n 1 |
Hall space group symbol | -P 2yac |
Residual factor for all reflections | 0.0222 |
Residual factor for significantly intense reflections | 0.0219 |
Weighted residual factors for significantly intense reflections | 0.0567 |
Weighted residual factors for all reflections included in the refinement | 0.0569 |
Goodness-of-fit parameter for all reflections included in the refinement | 1.008 |
Diffraction radiation wavelength | 0.71073 Å |
Diffraction radiation type | MoKα |