Information card for entry 7244212
Formula | C34 H40 N2 O10 S4 |
Calculated formula | C34 H40 N2 O10 S4 |
Title of publication | Expanding and quantifying the crystal chemistry of the flexible ligand 15aneN5 |
Authors of publication | Shircliff, Anthony D.; Allbritton, Elisabeth M. A.; Davilla, Dustin J.; Gorbet, Michael-Joseph; Jones, Donald G.; Tresp, David S.; Allen, Michael B.; Shrestha, Alina; Burgess, Gwendolyn E.; Eze, John I.; Fernandez, Andrea T.; Ramirez, Daniel; Shoff, Kody J.; Crispin, Garet G.; Crone, Sarah B.; Flinn, Michael; Tran, Tien; Bryce, Darby S.; Bond, Abbagale L.; Shockey, Dylan W.; Oliver, Allen G.; Krause, Jeanette A.; Prior, Timothy J.; Hubin, Timothy J. |
Journal of publication | CrystEngComm |
Year of publication | 2022 |
Journal volume | 24 |
Journal issue | 6 |
Pages of publication | 1218 - 1236 |
a | 5.7301 ± 0.0005 Å |
b | 18.629 ± 0.0015 Å |
c | 16.8629 ± 0.0016 Å |
α | 90° |
β | 91.518 ± 0.002° |
γ | 90° |
Cell volume | 1799.4 ± 0.3 Å3 |
Cell temperature | 150 K |
Ambient diffraction temperature | 150 K |
Number of distinct elements | 5 |
Space group number | 14 |
Hermann-Mauguin space group symbol | P 1 21/n 1 |
Hall space group symbol | -P 2yn |
Residual factor for all reflections | 0.0539 |
Residual factor for significantly intense reflections | 0.0351 |
Weighted residual factors for significantly intense reflections | 0.085 |
Weighted residual factors for all reflections included in the refinement | 0.0925 |
Goodness-of-fit parameter for all reflections included in the refinement | 1.023 |
Diffraction radiation wavelength | 0.7749 Å |
Diffraction radiation type | synchrotron |