Information card for entry 7701164
Formula | C6 H13 K N O9 V |
Calculated formula | C6 H13 K N O9 V |
Title of publication | Three peroxidovanadium(v) compounds mediated by transition metal cations for enhanced anticancer activity. |
Authors of publication | Chen, Fanghui; Gao, Zhiguo; You, Chaoqun; Wu, Hongshuai; Li, Yaojia; He, Xiaotong; Zhang, Yuchen; Zhang, Yaan; Sun, Baiwang |
Journal of publication | Dalton transactions (Cambridge, England : 2003) |
Year of publication | 2019 |
Journal volume | 48 |
Journal issue | 40 |
Pages of publication | 15160 - 15169 |
a | 15.149 ± 0.004 Å |
b | 7.717 ± 0.002 Å |
c | 18.928 ± 0.007 Å |
α | 90° |
β | 90° |
γ | 90° |
Cell volume | 2212.8 ± 1.2 Å3 |
Cell temperature | 293 ± 2 K |
Ambient diffraction temperature | 293 ± 2 K |
Number of distinct elements | 6 |
Space group number | 61 |
Hermann-Mauguin space group symbol | P b c a |
Hall space group symbol | -P 2ac 2ab |
Residual factor for all reflections | 0.1461 |
Residual factor for significantly intense reflections | 0.0801 |
Weighted residual factors for significantly intense reflections | 0.1582 |
Weighted residual factors for all reflections included in the refinement | 0.1909 |
Goodness-of-fit parameter for all reflections included in the refinement | 1.032 |
Diffraction radiation wavelength | 0.71073 Å |
Diffraction radiation type | MoKα |