Information card for entry 1008550
Chemical name |
Neodymium iron molybdenum nitride (1/10.5/1.5/0.8) |
Formula |
Fe10.52 Mo1.48 N0.8 Nd |
Calculated formula |
Fe10.52 Mo1.48 N0.8 Nd |
Title of publication |
Modulation of spin reorientation transitions in the series R(Fe,M)~12~X~y~ (R=Y,Nd,Ho;M=Mo,Ti;X=N,H) |
Authors of publication |
Tomey, E; Isnard, O; Fagan, A; Desmoulins, C; Miraglia, S; Soubeyroux, J L; Fruchart, D |
Journal of publication |
Journal of Alloys Compd. |
Year of publication |
1993 |
Journal volume |
191 |
Pages of publication |
233 - 238 |
a |
8.6398 ± 0.0009 Å |
b |
8.6398 ± 0.0009 Å |
c |
4.8437 ± 0.0006 Å |
α |
90° |
β |
90° |
γ |
90° |
Cell volume |
361.6 Å3 |
Number of distinct elements |
4 |
Space group number |
139 |
Hermann-Mauguin space group symbol |
I 4/m m m |
Hall space group symbol |
-I 4 2 |
Residual factor for all reflections |
0.021 |
Yes |
No |
No |