Information card for entry 1011351
Chemical name |
Manganese sulfide |
Mineral name |
Alabandite |
Formula |
Mn S |
Calculated formula |
Mn S |
SMILES |
[Mn+2].[S-2] |
Title of publication |
Die Strukturen von MnO, MnS, AgF, NiS, SnJ4, SrCl2, BaF2; Präzisionsmessungen einiger Alkalihalogenide |
Authors of publication |
Ott, H. |
Journal of publication |
Zeitschrift für Kristallographie, Kristallgeometrie, Kristallphysik, Kristallchemie |
Year of publication |
1926 |
Journal volume |
63 |
Pages of publication |
222 - 230 |
a |
5.24 Å |
b |
5.24 Å |
c |
5.24 Å |
α |
90° |
β |
90° |
γ |
90° |
Cell volume |
143.9 Å3 |
Number of distinct elements |
2 |
Space group number |
225 |
Hermann-Mauguin space group symbol |
F m -3 m |
Hall space group symbol |
-F 4 2 3 |
Yes |
No |
No |