Information card for entry 1100208
Chemical name |
Aminotriethylphosphonium iodide |
Formula |
C6 H17 I N P |
Calculated formula |
C6 H17 I N P |
Title of publication |
Die Kristallstrukturen einer Serie von Verbindungen mit Kationen des Typs [R~3~PNH~2~]^+^, [R3PN(H)SiMe~3~]^+^ und [R3PN(SiMe~3~)~2~]^+^ |
Authors of publication |
Chitsaz, S.; Folkerts, H.; Grebe, J.; Gröb, T.; Harms, K.; Hiller, W.; Krieger, M.; Massa, W.; Merle, J.; Möhlen, M.; Neumüller, B.; Dehnicke, K. |
Journal of publication |
Zeitschrift für Anorganische und Allgemeine Chemie |
Year of publication |
2000 |
Journal volume |
626 |
Journal issue |
3 |
Pages of publication |
775 - 783 |
a |
7.121 ± 0.001 Å |
b |
12.333 ± 0.002 Å |
c |
12.571 ± 0.002 Å |
α |
90° |
β |
90° |
γ |
90° |
Cell volume |
1104.03 Å3 |
Ambient diffraction temperature |
223 K |
Number of distinct elements |
5 |
Space group number |
19 |
Hermann-Mauguin space group symbol |
P 21 21 21 |
Hall space group symbol |
P 2ac 2ab |
Residual factor for significantly intense reflections |
5.76 |
Weighted residual factors for significantly intense reflections |
5.76 |
Yes |
No |
No |