Information card for entry 1100934
Common name | ytterbium chromium antimonide |
Chemical name | ytterbium chromium triantimonide |
Formula | Cr Sb3 Yb |
Calculated formula | Cr Sb3 Yb |
Title of publication | Structure and Physical Properties of Ternary Antimonide YbCr~3~Sb~3~ |
Authors of publication | Crerar, Shane J.; Deakin, Laura; Mar, Arthur |
Journal of publication | Chemistry of Materials |
Year of publication | 2005 |
Journal volume | 17 |
Journal issue | 10 |
Pages of publication | 2780 - 2784 |
a | 12.981 ± 0.003 Å |
b | 6.1396 ± 0.0012 Å |
c | 5.9926 ± 0.0012 Å |
α | 90° |
β | 90° |
γ | 90° |
Cell volume | 477.6 ± 0.16 Å3 |
Cell temperature | 295 ± 2 K |
Ambient diffraction temperature | 295 ± 2 K |
Number of distinct elements | 3 |
Space group number | 57 |
Hermann-Mauguin space group symbol | P b c m |
Hall space group symbol | -P 2c 2b |
Residual factor for all reflections | 0.071 |
Residual factor for significantly intense reflections | 0.059 |
Weighted residual factors for significantly intense reflections | 0.155 |
Weighted residual factors for all reflections included in the refinement | 0.1613 |
Goodness-of-fit parameter for all reflections included in the refinement | 1.173 |
Diffraction radiation wavelength | 0.71073 Å |
Diffraction radiation type | MoKα |
Duplicate of | 4000575 |