Information card for entry 1502116
Formula | C42 H52 O6 S4 |
Calculated formula | C42 H36 O6 S4 |
Title of publication | Unique inclusion properties of crystalline powder p-tert-butylthiacalix[4]arene toward alcohols and carboxylic acids. |
Authors of publication | Morohashi, Naoya; Noji, Shintaro; Nakayama, Hiroko; Kudo, Yasutaka; Tanaka, Shinya; Kabuto, Chizuko; Hattori, Tetsutaro |
Journal of publication | Organic letters |
Year of publication | 2011 |
Journal volume | 13 |
Journal issue | 13 |
Pages of publication | 3292 - 3295 |
a | 15.8002 ± 0.0007 Å |
b | 15.8002 ± 0.0007 Å |
c | 8.3491 ± 0.0007 Å |
α | 90° |
β | 90° |
γ | 90° |
Cell volume | 2084.3 ± 0.2 Å3 |
Cell temperature | 223 ± 2 K |
Ambient diffraction temperature | 223 ± 2 K |
Number of distinct elements | 4 |
Space group number | 129 |
Hermann-Mauguin space group symbol | P 4/n m m :2 |
Hall space group symbol | -P 4a 2a |
Residual factor for all reflections | 0.1124 |
Residual factor for significantly intense reflections | 0.105 |
Weighted residual factors for significantly intense reflections | 0.3192 |
Weighted residual factors for all reflections included in the refinement | 0.3539 |
Goodness-of-fit parameter for all reflections included in the refinement | 1.682 |
Diffraction radiation wavelength | 0.71073 Å |
Diffraction radiation type | MoKα |