Information card for entry 1509740
Formula |
Ag2.6 Al6.4 Ce3 |
Calculated formula |
Ag2.636 Al6.364 Ce3 |
Title of publication |
Neue ternaere Calcium-, und Ytterbium-Silber-Aluminide mit unterschiedlich gestapelten Silber-Aluminium Kagome-Netzen |
Authors of publication |
Mehner, A.; Henseleit, R.; Doersam, G.; Cordier, G.; Thies, S.; Czech, E.; Roehr, C.; Geibel, C. |
Journal of publication |
Journal of the Less-Common Metals |
Year of publication |
1991 |
Journal volume |
169 |
Pages of publication |
55 - 72 |
a |
5.637 Å |
b |
5.637 Å |
c |
26.913 Å |
α |
90° |
β |
90° |
γ |
120° |
Cell volume |
740.609 Å3 |
Number of distinct elements |
3 |
Space group number |
166 |
Hermann-Mauguin space group symbol |
R -3 m :H |
Hall space group symbol |
-R 3 2" |
Yes |
No |
No |