Information card for entry 1510992
Chemical name
Co2 Er B2
Formula
B2 Co2 Er
Calculated formula
B2 Co2 Er
Title of publication
Magnetism and structural chemistry of ternary borides RE Co2 B2: (RE= Y, La, Pr, Nd, Sm, Gd, Tb, Dy, Ho or Er) and boron substitution in (Y, Ce) Co2 Si2-x Bx
Authors of publication
Rogl, P.; Rupp, B.; Hulliger, F.
Journal of publication
Journal of the Less-Common Metals
Year of publication
1987
Journal volume
135
Pages of publication
113 - 125
a
3.545 Å
b
3.545 Å
c
9.161 Å
α
90°
β
90°
γ
90°
Cell volume
115.127 Å3
Number of distinct elements
3
Space group number
139
Hermann-Mauguin space group symbol
I 4/m m m
Hall space group symbol
-I 4 2
Yes
No
No