Information card for entry 1516400
Formula | C21 H14 N5 Ni S4 |
Calculated formula | C21 H14 N5 Ni S4 |
SMILES | C(#N)C1=C(C#N)S[Ni]2(S1)SC(=C(C#N)S2)C#N.c1cccc[n+]1Cc1ccc(cc1)C |
Title of publication | Two spin-peierls-like compounds exhibiting divergent structural features, lattice compression, and expansion in the low- temperature phase. |
Authors of publication | Tian, Zhengfang; Duan, Haibao; Ren, Xiaoming; Lu, Changsheng; Li, Yizhi; Song, You; Zhu, Huizhen; Meng, Qingjin |
Journal of publication | The journal of physical chemistry. B |
Year of publication | 2009 |
Journal volume | 113 |
Journal issue | 24 |
Pages of publication | 8278 - 8283 |
a | 7.239 ± 0.003 Å |
b | 12.109 ± 0.005 Å |
c | 26.347 ± 0.011 Å |
α | 88.629 ± 0.006° |
β | 86.36 ± 0.006° |
γ | 76.992 ± 0.004° |
Cell volume | 2245.6 ± 1.6 Å3 |
Cell temperature | 123 ± 2 K |
Ambient diffraction temperature | 123 ± 2 K |
Number of distinct elements | 5 |
Space group number | 2 |
Hermann-Mauguin space group symbol | P -1 |
Hall space group symbol | -P 1 |
Residual factor for all reflections | 0.0733 |
Residual factor for significantly intense reflections | 0.052 |
Weighted residual factors for significantly intense reflections | 0.1157 |
Weighted residual factors for all reflections included in the refinement | 0.1209 |
Goodness-of-fit parameter for all reflections included in the refinement | 1.049 |
Diffraction radiation wavelength | 0.71073 Å |
Diffraction radiation type | MoKα |