Information card for entry 1516736
Common name | N-acetyl-L-phe-methylester/Beta-Cyclodextrin |
Formula | C108 H170 N2 O99 |
Calculated formula | C98.652 H98 N1.221 O95.153 |
Title of publication | Molecular recognition in cyclodextrin complexes of amino acid derivatives: the effects of kinetic energy on the molecular recognition of a pseudopeptide in a nonconstraining host environment as revealed by a temperature-dependent crystallographic study. |
Authors of publication | Clark, Joanna L.; Peinado, Jessica; Stezowski, John J.; Vold, Robert L.; Huang, Yuanyuan; Hoatson, Gina L. |
Journal of publication | The journal of physical chemistry. B |
Year of publication | 2006 |
Journal volume | 110 |
Journal issue | 51 |
Pages of publication | 26375 - 26387 |
a | 17.97 ± 0.004 Å |
b | 15.393 ± 0.003 Å |
c | 15.514 ± 0.003 Å |
α | 103.18 ± 0.03° |
β | 113.22 ± 0.03° |
γ | 98.91 ± 0.03° |
Cell volume | 3693.4 ± 1.9 Å3 |
Cell temperature | 260 ± 2 K |
Ambient diffraction temperature | 260 ± 2 K |
Number of distinct elements | 4 |
Space group number | 1 |
Hermann-Mauguin space group symbol | P 1 |
Hall space group symbol | P 1 |
Residual factor for all reflections | 0.0951 |
Residual factor for significantly intense reflections | 0.0925 |
Weighted residual factors for significantly intense reflections | 0.2223 |
Weighted residual factors for all reflections included in the refinement | 0.2263 |
Goodness-of-fit parameter for all reflections included in the refinement | 1.067 |
Diffraction radiation wavelength | 0.71073 Å |
Diffraction radiation type | MoKα |