Information card for entry 1517615
Jmol._Canvas2D (Jmol) "jmolApplet0"[x]
Formula | C48 H24 Ag9 N9 O21 |
Calculated formula | C48 H24 Ag9 N9 O21 |
Title of publication | Layer-type organosilver(I) complexes assembled with nitrate and functionalized phenylethynide ligands |
Authors of publication | Ping-Shing Cheng; Sam C.K. Hau; Thomas C.W. Mak |
Journal of publication | Inorganica Chimica Acta |
Year of publication | 2013 |
Journal volume | 403 |
Pages of publication | 110 - 119 |
a | 32.06 ± 0.003 Å |
b | 7.9055 ± 0.0008 Å |
c | 20.4 ± 0.002 Å |
α | 90° |
β | 97.441 ± 0.002° |
γ | 90° |
Cell volume | 5126.8 ± 0.9 Å3 |
Cell temperature | 296 ± 2 K |
Ambient diffraction temperature | 296 ± 2 K |
Number of distinct elements | 5 |
Space group number | 15 |
Hermann-Mauguin space group symbol | C 1 2/c 1 |
Hall space group symbol | -C 2yc |
Residual factor for all reflections | 0.0854 |
Residual factor for significantly intense reflections | 0.0834 |
Weighted residual factors for significantly intense reflections | 0.2232 |
Weighted residual factors for all reflections included in the refinement | 0.2246 |
Goodness-of-fit parameter for all reflections included in the refinement | 1.166 |
Diffraction radiation wavelength | 0.71073 Å |
Diffraction radiation type | MoKα |