Information card for entry 1517653
Formula | C29.5 H51 Cd2 N4 O13.5 |
Calculated formula | C29.5 H35 Cd2 N4 O13.5 |
Title of publication | Eight coordination compounds based on a reduced Schiff base tetraaminodiphenol macrocyclic ligand |
Authors of publication | Ying-Ying Liu; Jie Liu; Jin Yang; Bo Liu; Jian-Fang Ma |
Journal of publication | Inorganica Chimica Acta |
Year of publication | 2013 |
Journal volume | 403 |
Pages of publication | 85 - 96 |
a | 11.848 ± 0.004 Å |
b | 11.98 ± 0.004 Å |
c | 16.172 ± 0.005 Å |
α | 70.674 ± 0.004° |
β | 77.724 ± 0.005° |
γ | 74.77 ± 0.004° |
Cell volume | 2070 ± 1.2 Å3 |
Cell temperature | 293 ± 2 K |
Ambient diffraction temperature | 293 ± 2 K |
Number of distinct elements | 5 |
Space group number | 2 |
Hermann-Mauguin space group symbol | P -1 |
Hall space group symbol | -P 1 |
Residual factor for all reflections | 0.1055 |
Residual factor for significantly intense reflections | 0.0598 |
Weighted residual factors for significantly intense reflections | 0.1589 |
Weighted residual factors for all reflections included in the refinement | 0.187 |
Goodness-of-fit parameter for all reflections included in the refinement | 0.982 |
Diffraction radiation wavelength | 0.71069 Å |
Diffraction radiation type | MoKα |