Information card for entry 1517824
Formula | C16 H19 Cu N3 O7 |
Calculated formula | C16 H19 Cu N3 O7 |
Title of publication | Copper glutarate coordination polymers with dipyridylamide ligands: Effect of donor disposition and steric bulk on structure |
Authors of publication | Jacob W. Uebler; Amy L. Pochodylo; Robert L. LaDuca |
Journal of publication | Inorganica Chimica Acta |
Year of publication | 2013 |
Journal volume | 405 |
Pages of publication | 31 - 42 |
a | 23.476 ± 0.003 Å |
b | 8.8641 ± 0.001 Å |
c | 17.5434 ± 0.0019 Å |
α | 90° |
β | 110.884 ± 0.001° |
γ | 90° |
Cell volume | 3410.8 ± 0.7 Å3 |
Cell temperature | 173 ± 2 K |
Ambient diffraction temperature | 173 ± 2 K |
Number of distinct elements | 5 |
Space group number | 15 |
Hermann-Mauguin space group symbol | C 1 2/c 1 |
Hall space group symbol | -C 2yc |
Residual factor for all reflections | 0.0395 |
Residual factor for significantly intense reflections | 0.0321 |
Weighted residual factors for significantly intense reflections | 0.0853 |
Weighted residual factors for all reflections included in the refinement | 0.0899 |
Goodness-of-fit parameter for all reflections included in the refinement | 1.055 |
Diffraction radiation wavelength | 0.71073 Å |
Diffraction radiation type | MoKα |