Information card for entry 1518045
Formula | Ca2 Cs Nb3 O10 |
Calculated formula | Ca2 Cs Nb3 O10 |
Title of publication | Structure cristalline de la perovskite feuilletee ferroelastique CsCa2Nb3O10 |
Authors of publication | Dion, Michel; Ganne, Marcel; Tournoux, Michel; Ravez, Jean |
Journal of publication | Revue de Chimie Minerale |
Year of publication | 1984 |
Journal volume | 21 |
Pages of publication | 92 - 103 |
a | 30.185 ± 0.003 Å |
b | 7.74 ± 0.002 Å |
c | 7.746 ± 0.002 Å |
α | 90° |
β | 90° |
γ | 90° |
Cell volume | 1809.7 ± 0.7 Å3 |
Ambient diffraction temperature | 293 K |
Number of distinct elements | 4 |
Space group number | 62 |
Hermann-Mauguin space group symbol | P n a m |
Hall space group symbol | -P 2c 2n |
Residual factor for significantly intense reflections | 0.028 |
Weighted residual factors for significantly intense reflections | 0.027 |
Diffraction radiation probe | x-ray |
Diffraction radiation wavelength | 0.71069 Å |
Diffraction radiation type | MoKα |