Information card for entry 1518409
Chemical name | TPP |
Formula | C28 H20 N2 |
Calculated formula | C28 H20 N2 |
SMILES | n1c(c(nc(c1c1ccccc1)c1ccccc1)c1ccccc1)c1ccccc1 |
Title of publication | Tetraphenylpyrazine-based AIEgens: facile preparation and tunable light emission |
Authors of publication | Chen, Ming; Li, Lingzhi; Nie, Han; Tong, Jiaqi; Yan, Lulin; Xu, Bin; Sun, Jing Zhi; Tian, Wenjing; Zhao, Zujin; Qin, Anjun; Tang, Ben Zhong |
Journal of publication | Chem. Sci. |
Year of publication | 2015 |
Journal volume | 6 |
Journal issue | 3 |
Pages of publication | 1932 |
a | 5.9763 ± 0.0005 Å |
b | 11.5786 ± 0.0008 Å |
c | 29.273 ± 0.003 Å |
α | 90° |
β | 90° |
γ | 90° |
Cell volume | 2025.6 ± 0.3 Å3 |
Cell temperature | 293 ± 2 K |
Ambient diffraction temperature | 293 ± 2 K |
Number of distinct elements | 3 |
Space group number | 19 |
Hermann-Mauguin space group symbol | P 21 21 21 |
Hall space group symbol | P 2ac 2ab |
Residual factor for all reflections | 0.0528 |
Residual factor for significantly intense reflections | 0.0392 |
Weighted residual factors for significantly intense reflections | 0.0894 |
Weighted residual factors for all reflections included in the refinement | 0.0976 |
Goodness-of-fit parameter for all reflections included in the refinement | 1.074 |
Diffraction radiation wavelength | 0.71073 Å |
Diffraction radiation type | MoKα |