Information card for entry 1518569
Formula | C15 H19 N O2 |
Calculated formula | C15 H19 N O2 |
SMILES | C1(=O)C=C(c2ccccc2)OC(CCN1C)(C)C |
Title of publication | Synthesis of Oxazocenones via Gold(I)-Catalyzed 8-Endo-Dig Hydroalkoxylation of Alkynamides. |
Authors of publication | Scully, Stephen S.; Zheng, Shao-Liang; Wagner, Bridget K.; Schreiber, Stuart L. |
Journal of publication | Organic letters |
Year of publication | 2015 |
Journal volume | 17 |
Journal issue | 3 |
Pages of publication | 418 - 421 |
a | 6.6977 ± 0.0007 Å |
b | 8.9166 ± 0.001 Å |
c | 11.8671 ± 0.0013 Å |
α | 97.4234 ± 0.0016° |
β | 102.013 ± 0.0016° |
γ | 108.163 ± 0.0015° |
Cell volume | 644.13 ± 0.12 Å3 |
Cell temperature | 100 ± 2 K |
Ambient diffraction temperature | 100 ± 2 K |
Number of distinct elements | 4 |
Space group number | 2 |
Hermann-Mauguin space group symbol | P -1 |
Hall space group symbol | -P 1 |
Residual factor for all reflections | 0.0485 |
Residual factor for significantly intense reflections | 0.038 |
Weighted residual factors for significantly intense reflections | 0.0969 |
Weighted residual factors for all reflections included in the refinement | 0.1017 |
Goodness-of-fit parameter for all reflections included in the refinement | 1.055 |
Diffraction radiation wavelength | 0.71073 Å |
Diffraction radiation type | MoKα |