Information card for entry 1518590
Common name | Au_B |
Formula | C24 H16 Au2 F8 N4 O2 |
Calculated formula | C24 H16 Au2 F8 N4 O2 |
Title of publication | Interconvertible multiple photoluminescence color of a gold(i) isocyanide complex in the solid state: solvent-induced blue-shifted and mechano-responsive red-shifted photoluminescence |
Authors of publication | Seki, Tomohiro; Ozaki, Taichi; Okura, Takuma; Asakura, Kiyotaka; Sakon, Aya; Uekusa, Hidehiro; Ito, Hajime |
Journal of publication | Chem. Sci. |
Year of publication | 2015 |
Journal volume | 6 |
Journal issue | 4 |
Pages of publication | 2187 |
a | 3.5452 ± 0.0004 Å |
b | 14.0087 ± 0.0015 Å |
c | 14.249 ± 0.0015 Å |
α | 109.292 ± 0.003° |
β | 91.673 ± 0.003° |
γ | 91.322 ± 0.002° |
Cell volume | 667.23 ± 0.13 Å3 |
Cell temperature | 173 ± 2 K |
Ambient diffraction temperature | 173 ± 2 K |
Ambient diffracton pressure | 101.3 kPa |
Number of distinct elements | 6 |
Space group number | 2 |
Hermann-Mauguin space group symbol | P -1 |
Hall space group symbol | -P 1 |
Residual factor for all reflections | 0.059 |
Residual factor for significantly intense reflections | 0.0473 |
Weighted residual factors for significantly intense reflections | 0.1055 |
Weighted residual factors for all reflections included in the refinement | 0.1165 |
Goodness-of-fit parameter for all reflections included in the refinement | 1.152 |
Diffraction radiation probe | x-ray |
Diffraction radiation wavelength | 0.71073 Å |
Diffraction radiation type | MoKα |