Information card for entry 1518624
Formula | C18 H10 B F2 N3 |
Calculated formula | C18 H10 B F2 N3 |
SMILES | [B]1(F)(F)N2C(c3cccc4cccc2c34)=C(c2cccc[n]12)C#N |
Title of publication | Diversity-Oriented Facile Access to Highly Fluorescent Membrane-Permeable Benz[c,d]indole N-Heteroarene BF2 Dyes. |
Authors of publication | Cheng, Chi; Gao, Naixun; Yu, Changjiang; Wang, Zhaoyun; Wang, Jun; Hao, Erhong; Wei, Yun; Mu, Xiaolong; Tian, Yanli; Ran, Chongzhao; Jiao, Lijuan |
Journal of publication | Organic letters |
Year of publication | 2015 |
Journal volume | 17 |
Journal issue | 2 |
Pages of publication | 278 - 281 |
a | 7.4838 ± 0.0008 Å |
b | 9.1552 ± 0.001 Å |
c | 11.5629 ± 0.0012 Å |
α | 79.781 ± 0.001° |
β | 71.778 ± 0.001° |
γ | 67.825 ± 0.001° |
Cell volume | 695.26 ± 0.13 Å3 |
Cell temperature | 293 ± 2 K |
Ambient diffraction temperature | 293 ± 2 K |
Number of distinct elements | 5 |
Space group number | 2 |
Hermann-Mauguin space group symbol | P -1 |
Hall space group symbol | -P 1 |
Residual factor for all reflections | 0.0506 |
Residual factor for significantly intense reflections | 0.0423 |
Weighted residual factors for significantly intense reflections | 0.119 |
Weighted residual factors for all reflections included in the refinement | 0.1289 |
Goodness-of-fit parameter for all reflections included in the refinement | 1.053 |
Diffraction radiation wavelength | 0.71073 Å |
Diffraction radiation type | MoKα |