Information card for entry 1518936
Formula | C18 H24 F N O4 S |
Calculated formula | C18 H24 F N O4 S |
SMILES | S1(=O)(=O)CC=C(F)C(C1)CN(Cc1ccccc1)C(=O)OC(C)(C)C |
Title of publication | Design, Synthesis, and Characterization of SO2-Containing Azabicyclo[3.n.1]alkanes: Promising Building Blocks for Drug Discovery. |
Authors of publication | Druzhenko, Tetiana; Denisenko, Olexandr; Kheylik, Yuri; Zozulya, Sergey; Shishkina, Svitlana S.; Tolmachev, Andrei; Mykhailiuk, Pavel K. |
Journal of publication | Organic letters |
Year of publication | 2015 |
Journal volume | 17 |
Journal issue | 8 |
Pages of publication | 1922 - 1925 |
a | 9.8882 ± 0.0006 Å |
b | 17.552 ± 0.001 Å |
c | 11.4151 ± 0.0008 Å |
α | 90° |
β | 103.067 ± 0.006° |
γ | 90° |
Cell volume | 1929.9 ± 0.2 Å3 |
Cell temperature | 293 ± 2 K |
Ambient diffraction temperature | 293 ± 2 K |
Number of distinct elements | 6 |
Space group number | 14 |
Hermann-Mauguin space group symbol | P 1 21/c 1 |
Hall space group symbol | -P 2ybc |
Residual factor for all reflections | 0.0742 |
Residual factor for significantly intense reflections | 0.0467 |
Weighted residual factors for significantly intense reflections | 0.112 |
Weighted residual factors for all reflections included in the refinement | 0.1239 |
Goodness-of-fit parameter for all reflections included in the refinement | 0.981 |
Diffraction radiation wavelength | 0.71073 Å |
Diffraction radiation type | MoKα |