Information card for entry 1519664
Chemical name | lithium titanium disulfide (lithium deficient) |
Formula | Li0.7 S2 Ti |
Calculated formula | Li0.7 S2 Ti |
Title of publication | Lithium Diffusion Pathways in 3R-LixTiS2: A Combined Neutron Diffraction and Computational Study |
Authors of publication | Wiedemann, Dennis; Islam, Mazharul M.; Nakhal, Suliman; Senyshyn, Anatoliy; Bredow, Thomas; Lerch, Martin |
Journal of publication | The Journal of Physical Chemistry C |
Year of publication | 2015 |
Journal volume | 119 |
Journal issue | 21 |
Pages of publication | 11370 |
a | 3.49658 ± 0.00008 Å |
b | 3.49658 ± 0.00008 Å |
c | 18.6529 ± 0.0007 Å |
α | 90° |
β | 90° |
γ | 120° |
Cell volume | 197.499 ± 0.01 Å3 |
Cell temperature | 973 K |
Ambient diffraction temperature | 973 K |
Number of distinct elements | 3 |
Space group number | 166 |
Hermann-Mauguin space group symbol | R -3 m :H |
Hall space group symbol | -R 3 2" |
Residual factor for all reflections | 0.0366 |
Residual factor for significantly intense reflections | 0.0239 |
Weighted residual factors for all reflections | 0.0277 |
Weighted residual factors for significantly intense reflections | 0.0263 |
Residual factor R(I) for significantly intense reflections | 0.0291 |
Goodness-of-fit parameter for all reflections | 1.04 |
Method of determination | powder diffraction |
Diffraction radiation probe | neutron |
Diffraction radiation wavelength | 1.54829 Å |
Diffraction radiation type | neutron |