Information card for entry 1519666
Formula | C26 H26 Co3 N2 O20 S2 |
Calculated formula | C26 H18 Co3 N2 O20 S2 |
Title of publication | Discrete and polymeric complexes formed from cobalt(ii), 4,4′-bipyridine and 2-sulfoterephthalate: synthetic, crystallographic and magnetic studies |
Authors of publication | Datta, Amitabha; Massera, Chiara; Clegg, Jack K.; Aromí, Guillem; Aguilà, David; Huang, Jui-Hsien; Chuang, Sheng-Jie |
Journal of publication | CrystEngComm |
Year of publication | 2015 |
Journal volume | 17 |
Journal issue | 24 |
Pages of publication | 4502 |
a | 25.2378 ± 0.0011 Å |
b | 8.6872 ± 0.0004 Å |
c | 18.8139 ± 0.0008 Å |
α | 90° |
β | 130.447 ± 0.005° |
γ | 90° |
Cell volume | 3139.1 ± 0.3 Å3 |
Cell temperature | 273 ± 2 K |
Ambient diffraction temperature | 273 ± 2 K |
Number of distinct elements | 6 |
Space group number | 15 |
Hermann-Mauguin space group symbol | C 1 2/c 1 |
Hall space group symbol | -C 2yc |
Residual factor for all reflections | 0.0626 |
Residual factor for significantly intense reflections | 0.0522 |
Weighted residual factors for significantly intense reflections | 0.1165 |
Weighted residual factors for all reflections included in the refinement | 0.1246 |
Goodness-of-fit parameter for all reflections included in the refinement | 1.081 |
Diffraction radiation wavelength | 0.71073 Å |
Diffraction radiation type | MoKα |