Information card for entry 1520121
Common name | Sinapic Acid + 6-Propyl-2-thiouracil . 2 Acetonitrile |
Formula | C22 H28 N4 O6 S |
Calculated formula | C22 H28 N4 O6 S |
SMILES | c1(cc(c(c(c1)OC)O)OC)/C=C/C(=O)O.C1(=S)NC(=O)C=C(N1)CCC.CC#N.CC#N |
Title of publication | Novel co-crystals of the nutraceutical sinapic acid |
Authors of publication | Sinha, A. S.; Rao Khandavilli, U. B.; O'Connor, E. L.; Deadman, B. J.; Maguire, A. R.; Lawrence, S. E. |
Journal of publication | CrystEngComm |
Year of publication | 2015 |
Journal volume | 17 |
Journal issue | 26 |
Pages of publication | 4832 |
a | 8.2922 ± 0.0008 Å |
b | 10.5857 ± 0.001 Å |
c | 14.7818 ± 0.0015 Å |
α | 98.274 ± 0.002° |
β | 94.315 ± 0.002° |
γ | 105.62 ± 0.002° |
Cell volume | 1227.7 ± 0.2 Å3 |
Cell temperature | 100 ± 2 K |
Ambient diffraction temperature | 100 ± 2 K |
Number of distinct elements | 5 |
Space group number | 2 |
Hermann-Mauguin space group symbol | P -1 |
Hall space group symbol | -P 1 |
Residual factor for all reflections | 0.0474 |
Residual factor for significantly intense reflections | 0.0393 |
Weighted residual factors for significantly intense reflections | 0.1031 |
Weighted residual factors for all reflections included in the refinement | 0.1089 |
Goodness-of-fit parameter for all reflections included in the refinement | 1.07 |
Diffraction radiation wavelength | 0.71073 Å |
Diffraction radiation type | MoKα |