Information card for entry 1520319
Common name | JR2192 |
Formula | C19 H23 B F2 N2 O5 |
Calculated formula | C19 H23 B F2 N2 O5 |
SMILES | CC(=O)[C@@]1([C@@H]([C@@H]2CC(=NO2)c2ccccc2)C)C(N2CCOCC2)=[O][B](O1)(F)F.CC(=O)[C@]1([C@H]([C@H]2CC(=NO2)c2ccccc2)C)C(N2CCOCC2)=[O][B](O1)(F)F |
Title of publication | α-Crotyl-α-difluoroboranyloxy-amides: Structure and Reactivity of Isolable Intermediates in Stereospecific α-Ketol Rearrangements. |
Authors of publication | Roßbach, Jan; Harms, Klaus; Koert, Ulrich |
Journal of publication | Organic letters |
Year of publication | 2015 |
Journal volume | 17 |
Journal issue | 12 |
Pages of publication | 3122 - 3125 |
a | 15.4609 ± 0.0006 Å |
b | 8.0727 ± 0.0002 Å |
c | 15.6576 ± 0.0005 Å |
α | 90° |
β | 103.611 ± 0.002° |
γ | 90° |
Cell volume | 1899.36 ± 0.11 Å3 |
Cell temperature | 100 ± 2 K |
Ambient diffraction temperature | 100 ± 2 K |
Number of distinct elements | 6 |
Space group number | 14 |
Hermann-Mauguin space group symbol | P 1 21/n 1 |
Hall space group symbol | -P 2yn |
Residual factor for all reflections | 0.0462 |
Residual factor for significantly intense reflections | 0.04 |
Weighted residual factors for significantly intense reflections | 0.0958 |
Weighted residual factors for all reflections included in the refinement | 0.0994 |
Goodness-of-fit parameter for all reflections included in the refinement | 1.054 |
Diffraction radiation wavelength | 0.71073 Å |
Diffraction radiation type | MoKα |