Information card for entry 1521375
Chemical name |
Cu (Ba0.8 Sr0.2)2 (Yb0.9 Ca0.1) Cu2 O6.104 |
Formula |
Ba1.6 Ca0.1 Cu3 O6.104 Sr0.4 Yb0.9 |
Calculated formula |
Ba1.6 Ca0.1 Cu3 O6.104 Sr0.4 Yb0.9 |
Title of publication |
Ca-substitution and O-doping effects in superconducting Cu (Ba0.8 Sr0.2)2 (Yb1-x Cax) Cu2 O6+z obtained from neutron diffraction refinements |
Authors of publication |
Karppinen, M.; Yamauchi, H.; Fujinami, K.; Nakane, T.; Tellgren, R.; Peitola, K.; Rundloef, H. |
Journal of publication |
Physical Review, Serie 3. B - Condensed Matter (18,1978-) |
Year of publication |
1999 |
Journal volume |
60 |
Pages of publication |
4378 - 4385 |
a |
3.8314 Å |
b |
3.8314 Å |
c |
11.745 Å |
α |
90° |
β |
90° |
γ |
90° |
Cell volume |
172.412 Å3 |
Number of distinct elements |
6 |
Space group number |
123 |
Hermann-Mauguin space group symbol |
P 4/m m m |
Hall space group symbol |
-P 4 2 |
Yes |
No |
No |