Information card for entry 1521982
Chemical name |
Nb2 Mn9 Ge8 |
Formula |
Ge8 Mn9 Nb2 |
Calculated formula |
Ge8 Mn9 Nb2 |
Title of publication |
Trois nouveaux siliciures ternaires ordonnes: (Cr, Nb ou Ta)11 Si8,(Mn, Mo)11 Si8 et les germaniures isotypes (T, Nb)11 Ge8, T = V, Cr, Mn |
Authors of publication |
Steinmetz, J.; Malaman, B.; Roques, B. |
Journal of publication |
Journal of the Less-Common Metals |
Year of publication |
1978 |
Journal volume |
57 |
Pages of publication |
133 - 146 |
a |
13.38 Å |
b |
16.07999 Å |
c |
5.12 Å |
α |
90° |
β |
90° |
γ |
90° |
Cell volume |
1101.57 Å3 |
Number of distinct elements |
3 |
Space group number |
62 |
Hermann-Mauguin space group symbol |
P n a m |
Hall space group symbol |
-P 2c 2n |
Yes |
No |
No |