Information card for entry 1522046
Chemical name |
Nd5 Mo32 O54 |
Formula |
Mo32 Nd5 O54 |
Calculated formula |
Mo32 Nd5 O54 |
Title of publication |
Synthesis, structural studies, and physical properties of the RE5 Mo32 O54 (RE = La, Ce, Pr, Nd) compounds containing trans-bicapped Mo8 octahedral clusters and Mo7 - Mo10 - Mo7 triclusters |
Authors of publication |
Tortelier, J.; Gougeon, P.; Noel, H.; Gall, P. |
Journal of publication |
Journal of Solid State Chemistry |
Year of publication |
2000 |
Journal volume |
152 |
Pages of publication |
403 - 411 |
a |
10.16 Å |
b |
9.115 Å |
c |
22.85 Å |
α |
90° |
β |
105.28° |
γ |
90° |
Cell volume |
2041.3 Å3 |
Number of distinct elements |
3 |
Space group number |
14 |
Hermann-Mauguin space group symbol |
P 1 21/c 1 |
Hall space group symbol |
-P 2ybc |
Yes |
No |
No |