Information card for entry 1523647
Chemical name |
Al2 (Dy0.83 Y0.17) |
Formula |
Al2 Dy0.83 Y0.17 |
Calculated formula |
Al2 Dy0.83 Y0.17 |
Title of publication |
Magnetic first-order phase transition and crossover associated with random anisotropy in crystalline Dyx Y1-x Al2 |
Authors of publication |
del Moral, A.; Gehring, P.M.; Arnaudas, J.I.; Salamon, M.B.; Ritter, C.; Joven, E.; Cullen, J. |
Journal of publication |
Physical Review, Serie 3. B - Condensed Matter (18,1978-) |
Year of publication |
1993 |
Journal volume |
47 |
Pages of publication |
7892 - 7896 |
a |
7.78685 Å |
b |
7.78685 Å |
c |
7.78685 Å |
α |
90° |
β |
90° |
γ |
90° |
Cell volume |
472.156 Å3 |
Number of distinct elements |
3 |
Space group number |
227 |
Hermann-Mauguin space group symbol |
F d -3 m :1 |
Hall space group symbol |
F 4d 2 3 -1d |
Yes |
No |
No |