Information card for entry 1523945
Formula | C24 H40 N4 O4 Si |
Calculated formula | C24 H40 N4 O4 Si |
SMILES | C1(=O)CCCCCN1[Si](N1C(=O)CCCCC1)(N1C(=O)CCCCC1)N1C(=O)CCCCC1 |
Title of publication | Polyamide 6/silica hybrid materials by a coupled polymerization reaction |
Authors of publication | Kaßner, L.; Nagel, K.; Grützner, R.-E.; Korb, M.; Rüffer, T.; Lang, H.; Spange, S. |
Journal of publication | Polym. Chem. |
Year of publication | 2015 |
Journal volume | 6 |
Journal issue | 35 |
Pages of publication | 6297 |
a | 18.1083 ± 0.0007 Å |
b | 17.6737 ± 0.0009 Å |
c | 7.671 ± 0.0003 Å |
α | 90° |
β | 90° |
γ | 90° |
Cell volume | 2455.03 ± 0.18 Å3 |
Cell temperature | 110 K |
Ambient diffraction temperature | 110 K |
Number of distinct elements | 5 |
Space group number | 33 |
Hermann-Mauguin space group symbol | P n a 21 |
Hall space group symbol | P 2c -2n |
Residual factor for all reflections | 0.0705 |
Residual factor for significantly intense reflections | 0.0562 |
Weighted residual factors for significantly intense reflections | 0.1307 |
Weighted residual factors for all reflections included in the refinement | 0.1384 |
Goodness-of-fit parameter for all reflections included in the refinement | 1.044 |
Diffraction radiation wavelength | 0.71073 Å |
Diffraction radiation type | MoKα |