Information card for entry 1524749
Chemical name |
(Fe0.14 Mn0.86)3 Pt |
Formula |
Fe0.42 Mn2.58 Pt |
Calculated formula |
Fe0.42 Mn2.58 Pt |
Title of publication |
Magnetic structure and exchange interactions in the Mn - Pt system |
Authors of publication |
Kren, E.; Kadar, G.; Pal, L.; Solyom, J.; Szabo, P.; Tarnoczi, T. |
Journal of publication |
Physical Review (1,1893-132,1963/141,1966-188,1969) |
Year of publication |
1968 |
Journal volume |
171 |
Pages of publication |
574 - 585 |
a |
3.833 Å |
b |
3.833 Å |
c |
3.833 Å |
α |
90° |
β |
90° |
γ |
90° |
Cell volume |
56.314 Å3 |
Number of distinct elements |
3 |
Space group number |
221 |
Hermann-Mauguin space group symbol |
P m -3 m |
Hall space group symbol |
-P 4 2 3 |
Yes |
No |
No |